Target
HIV WT-A pol protein (wild-type clade A)
Ligand
BDBM8125
Substrate
Meas. Tech.
Drug Susceptibility Assay
EC50
0.3±0.0 nM
Citation
 Shen, YAltman, MDAli, ANalam, MNCao, HRana, TMSchiffer, CATidor, B Testing the substrate-envelope hypothesis with designed pairs of compounds. ACS Chem Biol 8:2433-41 (2013)  
Target
Name:
HIV WT-A pol protein (wild-type clade A)
Synonyms:
Gag-Pol polyprotein [489-892,I502V,E524D,M525I,R530K,H558K,L578M,K599T,V609I,V623T,T627K,Q690K,C750S,T753I,K761S,D765E,V767I,T788A,I790V,Q795A,V833Q,E836D,A860P,R865K,K869R,T874A,E879D] WT-A | gag-pol
Type:
Protein
Mol. Mass.:
45854.50
Organism:
Human immunodeficiency virus
Description:
P12497[489-892,I502V,E524D,M525I,R530K,H558K,L578M,K599T,V609I,V623T,T627K,Q690K,C750S,T753I,K761S,D765E,V767I,T788A,I790V,Q795A,V833Q,E836D,A860P,R865K,K869R,T874A,E879D]
Residue:
404
  
Inhibitor
Name:
BDBM8125
Synonyms:
(3R,3aS,6aR)-hexahydrofuro[2,3-b]furan-3-yl N-[(2S,3R)-4-[(4-aminobenzene)(2-methylpropyl)sulfonamido]-3-hydroxy-1-phenylbutan-2-yl]carbamate Darunavir TMC-114 US10806794, Compound Darunavir
Type:
Small organic molecule
Emp. Form.:
C27H37N3O7S
Mol. Mass.:
547.664
SMILES:
[H][C@@]1(CO[C@@]2([H])OCC[C@@]12[H])OC(=O)N[C@@H](Cc1ccccc1)[C@H](O)CN(CC(C)C)S(=O)(=O)c1ccc(N)cc1
: