Target
3-phosphoinositide-dependent protein kinase 1
Ligand
BDBM105305
Substrate
Meas. Tech.
Kinase Assay
IC50
2±0.0 nM
Citation
 Engelhardt, HKofink, CMcConnell, D Chemical compounds US Patent  US8575203 Publication Date 11/5/2013 
Target
Name:
3-phosphoinositide-dependent protein kinase 1
Synonyms:
3-Phosphoinositide-Dependent Protein Kinase 1 (PDK1) 3-phosphoinositide-dependent protein kinase 1 3-phosphoinositide-dependent protein kinase 1 (PDK-1) Isoform 2 of 3-phosphoinositide-dependent protein kinase 1 PDPK1 Phosphoinositide-dependent protein kinase 1 (PDK1) hPDK1
Type:
Enzyme
Mol. Mass.:
63157.65
Organism:
Homo sapiens (Human)
Description:
O15530
Residue:
556
  
Inhibitor
Name:
BDBM105305
Synonyms:
US8575203, I-72
Type:
Small organic molecule
Emp. Form.:
C32H31F2N5O2
Mol. Mass.:
555.6176
SMILES:
CCN1CCC(CC1)Nc1cnc2ccc(cc2c1)C#CCNC(=O)c1cccn(Cc2ccc(F)c(F)c2)c1=O
: