Target
Polyunsaturated fatty acid lipoxygenase ALOX15B
Ligand
BDBM106787
Substrate
Meas. Tech.
IC50 Assay
pH
7.5±0
Temperature
296.15±0 K
IC50
3.4e+4±n/a nM
Citation
 Mascayano, CEspinosa, VSepúlveda-Boza, SSepúlveda-Boza, EKPerry, S In vitro study of isoflavones and isoflavans as potent inhibitors of human 12- and 15-lipoxygenases. Chem Biol Drug Des 82:317-25 (2013)  
Target
Name:
Polyunsaturated fatty acid lipoxygenase ALOX15B
Synonyms:
15-LOX-2 15-Lipoxygenase-2 (15-LOX-2) ALOX15B Arachidonate 15-lipoxygenase, type II Epithelial 15-lipoxygenase-2 | LX15B_HUMAN
Type:
Protein
Mol. Mass.:
75850.40
Organism:
Homo sapiens (Human)
Description:
Residue:
676
  
Inhibitor
Name:
BDBM106787
Synonyms:
3‐(4‐methylphenyl)‐3,4‐dihydro‐2H‐1‐benzopyran‐7,8‐ diol HIR-303
Type:
Small organic molecule
Emp. Form.:
C16H16O3
Mol. Mass.:
256.2964
SMILES:
Cc1ccc(cc1)C1COc2c(C1)ccc(O)c2O
: