Target
Alpha-galactosidase
Ligand
BDBM108216
Substrate
Meas. Tech.
Inhibition Assay Against Commercial Glycosidases
pH
10.6±n/a
Temperature
310.15±n/a K
IC50
1.61e+4±n/a nM
Comments
extracted
Citation
 Li, ZLi, TDai, SXie, XMa, XZhao, WZhang, WLi, JWang, PG New insights into the pharmacological chaperone activity of c2-substituted glucoimidazoles for the treatment of Gaucher disease. Chembiochem 14:1239-47 (2013)  
Target
Name:
Alpha-galactosidase
Synonyms:
α-galactosidase Alpha-galactosidase
Type:
Protein
Mol. Mass.:
41306.82
Organism:
Coffea arabica (Coffee beans)
Description:
Residue:
378
  
Inhibitor
Name:
BDBM108216
Synonyms:
5-(hydroxymethyl)-2-(2-phenylethyl)-5H,6H,7H,8H- imidazo[1,2-a]pyridine-6,7,8-triol (Compound 2)
Type:
Small organic molecule
Emp. Form.:
C16H20N2O4
Mol. Mass.:
304.341
SMILES:
OCC1C(O)C(O)C(O)c2nc(CCc3ccccc3)cn12
: