Target
Adenosine receptor A2
Ligand
BDBM97464
Substrate
Meas. Tech.
Binding Assay
Ki
4692±0.0 nM
Citation
 Jagtap, PSzabo, CSalzman, AL Purine derivatives as adenosine A1 receptor agonists and methods of use thereof US Patent  US8609833 Publication Date 12/17/2013 
Target
Name:
Adenosine receptor A2
Synonyms:
ADORA2A | C9JQD8_HUMAN
Type:
Enzyme
Mol. Mass.:
40112.08
Organism:
Homo sapiens (Human)
Description:
C9JQD8
Residue:
365
  
Inhibitor
Name:
BDBM97464
Synonyms:
US8470800, A | US8609833, 17
Type:
Small organic molecule
Emp. Form.:
C15H20N6O6
Mol. Mass.:
380.3559
SMILES:
O[C@@H]1[C@@H](CO[N+]([O-])=O)O[C@H]([C@@H]1O)n1cnc2c(NC3CCCC3)ncnc12
: