Target
Tyrosine-protein kinase ABL1
Ligand
BDBM112057
Substrate
Meas. Tech.
In Vitro Enzyme Assay
Ki
0.09±n/a nM
Citation
 Lyssikatos, JPGazzard, LJHanan, EKintz, SPurkey, HE Substituted 6,6-fused nitrogenous heterocyclic compounds and uses thereof US Patent  US8623889 Publication Date 1/7/2014 
Target
Name:
Tyrosine-protein kinase ABL1
Synonyms:
ABL ABL1_HUMAN JTK7 Proto-oncogene tyrosine-protein kinase ABL1 Tyrosine-protein kinase ABL V-abl Abelson murine leukemia viral oncogene homolog 1 p150 | tyrosine-protein kinase ABL1 isoform a
Type:
Enzyme
Mol. Mass.:
122897.30
Organism:
Homo sapiens (Human)
Description:
P00519
Residue:
1130
  
Inhibitor
Name:
BDBM112057
Synonyms:
US8623889, 55
Type:
Small organic molecule
Emp. Form.:
C20H16F2N2O
Mol. Mass.:
338.3506
SMILES:
Cc1ccc(F)cc1-c1ccc2cc(NC(=O)C3C[C@@H]3F)ncc2c1
: