Target
Tyrosine-protein kinase JAK3
Ligand
BDBM112615
Substrate
Meas. Tech.
Inhibition Assay
pH
7.2±n/a
Ki
0.01631±n/a nM
IC50
0.005185±n/a nM
Citation
 de Vicente Fidalgo, JHermann, JCLemoine, RLi, HLovey, AJSjogren, EBSoth, M Inhibitors of JAK US Patent  US8618103 Publication Date 12/31/2013 
Target
Name:
Tyrosine-protein kinase JAK3
Synonyms:
JAK-3 JAK3_HUMAN Janus kinase 3 (JAK3) L-JAK | Leukocyte janus kinase
Type:
Protein
Mol. Mass.:
125111.08
Organism:
Homo sapiens (Human)
Description:
P52333
Residue:
1124
  
Inhibitor
Name:
BDBM112615
Synonyms:
US8618103, I-111
Type:
Small organic molecule
Emp. Form.:
C25H37N9O2S
Mol. Mass.:
527.685
SMILES:
CC(C)CS(=O)(=O)N1C[C@@H](C)C[C@@H](C1)Nc1nc(ncc1-c1cnc2[nH]ccc2n1)N1CCN(C)CC1
: