Target
Androgen receptor
Ligand
BDBM112792
Substrate
Meas. Tech.
Biological Assay
IC50
5±n/a nM
Citation
 Miller, CP Selective androgen receptor modulators US Patent  US8629167 Publication Date 1/14/2014 
Target
Name:
Androgen receptor
Synonyms:
ANDR_RAT Ar Nr3c4 | androgen
Type:
Enzyme
Mol. Mass.:
98219.08
Organism:
Rattus norvegicus (Rat)
Description:
P15207
Residue:
902
  
Inhibitor
Name:
BDBM112792
Synonyms:
US8629167, 2
Type:
Small organic molecule
Emp. Form.:
C20H19ClN4O3
Mol. Mass.:
398.843
SMILES:
COc1ccc(cc1)-c1nnc(o1)[C@H](Nc1ccc([N+]#[C-])c(Cl)c1C)[C@H](C)O
: