Target
Androgen receptor
Ligand
BDBM112829
Substrate
Meas. Tech.
Biological Assay
IC50
0.2±n/a nM
Citation
 Miller, CP Selective androgen receptor modulators US Patent  US8629167 Publication Date 1/14/2014 
Target
Name:
Androgen receptor
Synonyms:
ANDR_RAT Ar Nr3c4 | androgen
Type:
Enzyme
Mol. Mass.:
98219.08
Organism:
Rattus norvegicus (Rat)
Description:
P15207
Residue:
902
  
Inhibitor
Name:
BDBM112829
Synonyms:
US8629167, 40
Type:
Small organic molecule
Emp. Form.:
C19H16ClFN4O3
Mol. Mass.:
402.807
SMILES:
C[C@H](O)[C@@H](Nc1ccc([N+]#[C-])c(Cl)c1C)c1nnc(o1)-c1ccc(F)c(O)c1
: