Target
Androgen receptor
Ligand
BDBM112852
Substrate
Meas. Tech.
Biological Assay
IC50
1±n/a nM
Citation
 Miller, CP Selective androgen receptor modulators US Patent  US8629167 Publication Date 1/14/2014 
Target
Name:
Androgen receptor
Synonyms:
ANDR_RAT Ar Nr3c4 | androgen
Type:
Enzyme
Mol. Mass.:
98219.08
Organism:
Rattus norvegicus (Rat)
Description:
P15207
Residue:
902
  
Inhibitor
Name:
BDBM112852
Synonyms:
US8629167, 64
Type:
Small organic molecule
Emp. Form.:
C20H15FN4O2S
Mol. Mass.:
394.422
SMILES:
C[C@@H](O)[C@@H](Nc1ccc([N+]#[C-])c2sccc12)c1nnc(o1)-c1ccc(F)cc1
: