Target
Proto-oncogene tyrosine-protein kinase Src
Ligand
BDBM4542
Substrate
cdc2 substrate peptide
Meas. Tech.
Kinase Inhibition Assay
pH
7.5±n/a
Temperature
303.15±n/a K
IC50
1.6±n/a nM
Citation
 Boschelli, DHYe, FWang, YDDutia, MJohnson, SLWu, BMiller, KPowell, DWYaczko, DYoung, MTischler, MArndt, KDiscafani, CEtienne, CGibbons, JGrod, JLucas, JWeber, JMBoschelli, F Optimization of 4-phenylamino-3-quinolinecarbonitriles as potent inhibitors of Src kinase activity. J Med Chem 44:3965-77 (2001)  
Target
Name:
Proto-oncogene tyrosine-protein kinase Src
Synonyms:
Calmodulin/Proto-oncogene tyrosine-protein kinase Src Proto-oncogene c-Src SRC SRC_HUMAN V-src sarcoma (Schmidt-Ruppin A-2) viral oncogene homolog (avian) p60-Src | pp60c-src
Type:
Protein
Mol. Mass.:
59838.60
Organism:
Homo sapiens (Human)
Description:
P12931
Residue:
536
  
Inhibitor
Name:
BDBM4542
Synonyms:
4-Phenylamino-3-quinolinecarbonitrile deriv. 2b 4-[(2-chloro-5-methoxyphenyl)amino]-6-methoxy-7-[3-(morpholin-4-yl)propoxy]quinoline-3-carbonitrile
Type:
Small organic molecule
Emp. Form.:
C25H27ClN4O4
Mol. Mass.:
482.959
SMILES:
COc1ccc(Cl)c(Nc2c(cnc3cc(OCCCN4CCOCC4)c(OC)cc23)C#N)c1
:
Substrate
Name:
cdc2 substrate peptide
Synonyms:
Type:
Peptide
Mol. Mass.:
358.43
Organism:
Description:
100 uM ATP as co-substrate
Residue:
3
NA