Target
Disintegrin and metalloproteinase domain-containing protein 17
Ligand
BDBM67733
Substrate
Meas. Tech.
Counterscreen for exosite inhibitors of ADAM10: QFRET-based biochemical high throughput dose response assay to identify inhibitors of ADAM17
IC50
69479±n/a nM
Citation
 PubChem, PC Counterscreen for exosite inhibitors of ADAM10: QFRET-based biochemical high throughput dose response assay to identify inhibitors of ADAM17 PubChem Bioassay (2014)[AID] 
Target
Name:
Disintegrin and metalloproteinase domain-containing protein 17
Synonyms:
ADA17_HUMAN CSVP Disintegrin and metalloproteinase domain-containing protein 17 (ADAM17) TNF-alpha convertase TNF-alpha-converting enzyme (TACE) Tumor necrosis factor-α converting enzyme (TACE)
Type:
Enzyme
Mol. Mass.:
93007.89
Organism:
Homo sapiens (Human)
Description:
Residue:
824
  
Inhibitor
Name:
BDBM67733
Synonyms:
(6E)-6-[4-(2-methoxyphenoxy)-5-methyl-1,2-dihydropyrazol-3-ylidene]-3-(2-methylprop-2-enoxy)-1-cyclohexa-2,4-dienone (6E)-6-[4-(2-methoxyphenoxy)-5-methyl-3-pyrazolin-3-ylidene]-3-(2-methylallyloxy)cyclohexa-2,4-dien-1-one SMR000045197 | cid_5389819
Type:
Small organic molecule
Emp. Form.:
C21H22N2O4
Mol. Mass.:
366.4104
SMILES:
COc1ccccc1Oc1c(C)[nH]nc1-c1ccc(OCC(C)=C)cc1O
: