Target
Disintegrin and metalloproteinase domain-containing protein 10
Ligand
BDBM113913
Substrate
Meas. Tech.
QFRET-based biochemical high throughput dose response assay to identify exosite inhibitors of ADAM10.
IC50
9769±n/a nM
Citation
 PubChem, PC QFRET-based biochemical high throughput dose response assay to identify exosite inhibitors of ADAM10. PubChem Bioassay (2014)[AID] 
Target
Name:
Disintegrin and metalloproteinase domain-containing protein 10
Synonyms:
ADA10_HUMAN Disintegrin and metalloproteinase domain-containing protein 10 (ADAM10) MADM
Type:
Enzyme
Mol. Mass.:
84160.93
Organism:
Homo sapiens (Human)
Description:
O14672
Residue:
748
  
Inhibitor
Name:
BDBM113913
Synonyms:
(2S)-2-[[5-[[4-[(tert-butoxycarbonylamino)methyl]benzyl]carbamoyl]-1H-imidazole-4-carbonyl]amino]-3-phenyl-propionic acid tert-butyl ester ILP-I-64 SMR000641969 tert-butyl (2S)-2-[[5-[[4-[[(2-methylpropan-2-yl)oxycarbonylamino]methyl]phenyl]methylcarbamoyl]-1H-imidazol-4-yl]carbonylamino]-3-phenyl-propanoate | tert-butyl (2S)-2-[[5-[[4-[[(2-methylpropan-2-yl)oxycarbonylamino]methyl]phenyl]methylcarbamoyl]-1H-imidazole-4-carbonyl]amino]-3-phenylpropanoate
Type:
Small organic molecule
Emp. Form.:
C31H39N5O6
Mol. Mass.:
577.6713
SMILES:
CC(C)(C)OC(=O)NCc1ccc(CNC(=O)c2nc[nH]c2C(=O)N[C@@H](Cc2ccccc2)C(=O)OC(C)(C)C)cc1
: