Target
Disintegrin and metalloproteinase domain-containing protein 10
Ligand
BDBM83873
Substrate
Meas. Tech.
QFRET-based biochemical high throughput dose response assay to identify exosite inhibitors of ADAM10.
IC50
8899±n/a nM
Citation
 PubChem, PC QFRET-based biochemical high throughput dose response assay to identify exosite inhibitors of ADAM10. PubChem Bioassay (2014)[AID] 
Target
Name:
Disintegrin and metalloproteinase domain-containing protein 10
Synonyms:
ADA10_HUMAN Disintegrin and metalloproteinase domain-containing protein 10 (ADAM10) MADM
Type:
Enzyme
Mol. Mass.:
84160.93
Organism:
Homo sapiens (Human)
Description:
O14672
Residue:
748
  
Inhibitor
Name:
BDBM83873
Synonyms:
3-[[2-keto-3-methyl-5-[3-(trifluoromethyl)phenyl]indolin-3-yl]methyl]benzonitrile 3-[[3-methyl-2-oxo-5-[3-(trifluoromethyl)phenyl]-1H-indol-3-yl]methyl]benzonitrile SMR001453931 | cid_49792284
Type:
Small organic molecule
Emp. Form.:
C24H17F3N2O
Mol. Mass.:
406.3998
SMILES:
CC1(Cc2cccc(c2)C#N)C(=O)Nc2ccc(cc12)-c1cccc(c1)C(F)(F)F
: