Target
Disintegrin and metalloproteinase domain-containing protein 10
Ligand
BDBM114121
Substrate
Meas. Tech.
Counterscreen for exosite inhibitors of ADAM17: Fluorescence resonance energy transfer (FRET)-based biochemical high throughput dose response assay to identify inhibitors of ADAM10
IC50
12140±n/a nM
Citation
 PubChem, PC Counterscreen for exosite inhibitors of ADAM17: Fluorescence resonance energy transfer (FRET)-based biochemical high throughput dose response assay to identify inhibitors of ADAM10 PubChem Bioassay (2014)[AID] 
Target
Name:
Disintegrin and metalloproteinase domain-containing protein 10
Synonyms:
ADA10_HUMAN Disintegrin and metalloproteinase domain-containing protein 10 (ADAM10) MADM
Type:
Enzyme
Mol. Mass.:
84160.93
Organism:
Homo sapiens (Human)
Description:
O14672
Residue:
748
  
Inhibitor
Name:
BDBM114121
Synonyms:
(1S,5R)-3-(3-benzoxyphenyl)-8-[2-(4-methoxyphenoxy)ethylcarbamoyl]-8-azabicyclo[3.2.1]oct-3-ene-4-carboxylic acid methyl ester MLS002472219 cid_44144143 | methyl (1S,5R)-8-[2-(4-methoxyphenoxy)ethylcarbamoyl]-3-(3-phenylmethoxyphenyl)-8-azabicyclo[3.2.1]oct-3-ene-4-carboxylate
Type:
Small organic molecule
Emp. Form.:
C32H34N2O6
Mol. Mass.:
542.6222
SMILES:
COC(=O)C1=C(C[C@@H]2CC[C@H]1N2C(=O)NCCOc1ccc(OC)cc1)c1cccc(OCc2ccccc2)c1
: