Target
Disintegrin and metalloproteinase domain-containing protein 17
Ligand
BDBM114049
Substrate
Meas. Tech.
QFRET-based biochemical high throughput dose response assay to identify exosite inhibitors of ADAM17
IC50
69487±n/a nM
Citation
 PubChem, PC QFRET-based biochemical high throughput dose response assay to identify exosite inhibitors of ADAM17 PubChem Bioassay (2014)[AID] 
Target
Name:
Disintegrin and metalloproteinase domain-containing protein 17
Synonyms:
ADA17_HUMAN CSVP Disintegrin and metalloproteinase domain-containing protein 17 (ADAM17) TNF-alpha convertase TNF-alpha-converting enzyme (TACE) Tumor necrosis factor-α converting enzyme (TACE)
Type:
Enzyme
Mol. Mass.:
93007.89
Organism:
Homo sapiens (Human)
Description:
Residue:
824
  
Inhibitor
Name:
BDBM114049
Synonyms:
(Z)-2,3-bis(2-thienyl)acrylic acid [2-[3-(dimethylsulfamoyl)-4-methyl-anilino]-2-keto-ethyl] ester MLS000409385 [2-[3-(dimethylsulfamoyl)-4-methylanilino]-2-oxoethyl] (Z)-2,3-dithiophen-2-ylprop-2-enoate cid_6532763
Type:
Small organic molecule
Emp. Form.:
C22H22N2O5S3
Mol. Mass.:
490.615
SMILES:
CN(C)S(=O)(=O)c1cc(NC(=O)COC(=O)C(=C\c2cccs2)\c2cccs2)ccc1C
: