Target
Disintegrin and metalloproteinase domain-containing protein 17
Ligand
BDBM37867
Substrate
Meas. Tech.
QFRET-based biochemical high throughput dose response assay to identify exosite inhibitors of ADAM17
IC50
3763±n/a nM
Citation
 PubChem, PC QFRET-based biochemical high throughput dose response assay to identify exosite inhibitors of ADAM17 PubChem Bioassay (2014)[AID] 
Target
Name:
Disintegrin and metalloproteinase domain-containing protein 17
Synonyms:
ADA17_HUMAN CSVP Disintegrin and metalloproteinase domain-containing protein 17 (ADAM17) TNF-alpha convertase TNF-alpha-converting enzyme (TACE) Tumor necrosis factor-α converting enzyme (TACE)
Type:
Enzyme
Mol. Mass.:
93007.89
Organism:
Homo sapiens (Human)
Description:
Residue:
824
  
Inhibitor
Name:
BDBM37867
Synonyms:
2-thiophenecarbothioic acid S-(2,3-dihydroxy-4-mercaptobutyl) ester PCMD-CC-MCM-30 S-[2,3-bis(oxidanyl)-4-sulfanyl-butyl] thiophene-2-carbothioate thiophene-2-carbothioic acid S-(2,3-dihydroxy-4-mercapto-butyl) ester
Type:
Small organic molecule
Emp. Form.:
C9H12O3S3
Mol. Mass.:
264.385
SMILES:
OC(CS)C(O)CSC(=O)c1cccs1
: