Target
Tyrosyl-DNA phosphodiesterase 2
Ligand
BDBM35362
Substrate
Meas. Tech.
Epi Absorbance-based biochemical high throughput dose response assay to identify inhibitors of human tyrosyl-DNA phosphodiesterase 2 (TDP2)
IC50
29094±n/a nM
Citation
 PubChem, PC Epi Absorbance-based biochemical high throughput dose response assay to identify inhibitors of human tyrosyl-DNA phosphodiesterase 2 (TDP2) PubChem Bioassay (2014)[AID] 
Target
Name:
Tyrosyl-DNA phosphodiesterase 2
Synonyms:
EAP2 ETS1-associated protein 2 TDP2 TTRAP Tyr-DNA phosphodiesterase 2 Tyrosyl-DNA phosphodiesterase 2 (hTDP2) VPg unlinkase | hTDP2
Type:
Enzyme Catalytic Domain
Mol. Mass.:
40916.54
Organism:
Homo sapiens (Human)
Description:
gi_23510348
Residue:
362
  
Inhibitor
Name:
BDBM35362
Synonyms:
5-bromanyl-N-(3-cyano-1-phenyl-pyrrolo[3,2-b]quinoxalin-2-yl)furan-2-carboxamide 5-bromo-N-(3-cyano-1-phenyl-pyrrolo[3,2-b]quinoxalin-2-yl)-2-furamide MLS000068756 cid_658921
Type:
Small organic molecule
Emp. Form.:
C22H12BrN5O2
Mol. Mass.:
458.267
SMILES:
Brc1ccc(o1)C(=O)Nc1c(C#N)c2nc3ccccc3nc2n1-c1ccccc1
: