Target
Tyrosyl-DNA phosphodiesterase 2
Ligand
BDBM80755
Substrate
Meas. Tech.
Epi Absorbance-based biochemical high throughput dose response assay to identify inhibitors of human tyrosyl-DNA phosphodiesterase 2 (TDP2)
IC50
2661±n/a nM
Citation
 PubChem, PC Epi Absorbance-based biochemical high throughput dose response assay to identify inhibitors of human tyrosyl-DNA phosphodiesterase 2 (TDP2) PubChem Bioassay (2014)[AID] 
Target
Name:
Tyrosyl-DNA phosphodiesterase 2
Synonyms:
EAP2 ETS1-associated protein 2 TDP2 TTRAP Tyr-DNA phosphodiesterase 2 Tyrosyl-DNA phosphodiesterase 2 (hTDP2) VPg unlinkase | hTDP2
Type:
Enzyme Catalytic Domain
Mol. Mass.:
40916.54
Organism:
Homo sapiens (Human)
Description:
gi_23510348
Residue:
362
  
Inhibitor
Name:
BDBM80755
Synonyms:
6-amino-7-bromo-quinoline-5,8-quinone 6-azanyl-7-bromanyl-quinoline-5,8-dione SMR001565537 | cid_266923
Type:
Small organic molecule
Emp. Form.:
C9H5BrN2O2
Mol. Mass.:
253.052
SMILES:
NC1=C(Br)C(=O)c2ncccc2C1=O
: