Target
1-phosphatidylinositol 4,5-bisphosphate phosphodiesterase beta-3
Ligand
BDBM114218
Substrate
Meas. Tech.
Fluorescence-based biochemical high throughput dose response assay to identify inhibitors of phospholipase C isozymes (PLC-B3)
IC50
122443±n/a nM
Citation
 PubChem, PC Fluorescence-based biochemical high throughput dose response assay to identify inhibitors of phospholipase C isozymes (PLC-B3) PubChem Bioassay (2014)[AID] 
Target
Name:
1-phosphatidylinositol 4,5-bisphosphate phosphodiesterase beta-3
Synonyms:
PLCB3 Phospholipase C, beta 3 (phosphatidylinositol-specific) | Phospholipase C-beta-3
Type:
PROTEIN
Mol. Mass.:
138786.29
Organism:
Homo sapiens (Human)
Description:
EBI_12586
Residue:
1234
  
Inhibitor
Name:
BDBM114218
Synonyms:
MLS000087109 N-(2,4-difluorophenyl)-5-(2-methoxyphenyl)-3-isoxazolecarboxamide N-[2,4-bis(fluoranyl)phenyl]-5-(2-methoxyphenyl)-1,2-oxazole-3-carboxamide cid_3235858
Type:
Small organic molecule
Emp. Form.:
C17H12F2N2O3
Mol. Mass.:
330.2856
SMILES:
COc1ccccc1-c1cc(no1)C(=O)Nc1ccc(F)cc1F
: