Target
1-phosphatidylinositol 4,5-bisphosphate phosphodiesterase beta-3
Ligand
BDBM114223
Substrate
Meas. Tech.
Fluorescence-based biochemical high throughput dose response assay to identify inhibitors of phospholipase C isozymes (PLC-B3)
IC50
122451±n/a nM
Citation
 PubChem, PC Fluorescence-based biochemical high throughput dose response assay to identify inhibitors of phospholipase C isozymes (PLC-B3) PubChem Bioassay (2014)[AID] 
Target
Name:
1-phosphatidylinositol 4,5-bisphosphate phosphodiesterase beta-3
Synonyms:
PLCB3 Phospholipase C, beta 3 (phosphatidylinositol-specific) | Phospholipase C-beta-3
Type:
PROTEIN
Mol. Mass.:
138786.29
Organism:
Homo sapiens (Human)
Description:
EBI_12586
Residue:
1234
  
Inhibitor
Name:
BDBM114223
Synonyms:
2-[[4-(2-methylphenyl)-5-[(2-oxo-1,3-benzothiazol-3-yl)methyl]-1,2,4-triazol-3-yl]thio]acetic acid ethyl ester MLS000118628 cid_5308591 ethyl 2-[[4-(2-methylphenyl)-5-[(2-oxo-1,3-benzothiazol-3-yl)methyl]-1,2,4-triazol-3-yl]sulfanyl]acetate
Type:
Small organic molecule
Emp. Form.:
C21H20N4O3S2
Mol. Mass.:
440.538
SMILES:
CCOC(=O)CSc1nnc(Cn2c3ccccc3sc2=O)n1-c1ccccc1C
: