Target
1-phosphatidylinositol 4,5-bisphosphate phosphodiesterase beta-3
Ligand
BDBM114226
Substrate
Meas. Tech.
Fluorescence-based biochemical high throughput dose response assay to identify inhibitors of phospholipase C isozymes (PLC-B3)
IC50
122493±n/a nM
Citation
 PubChem, PC Fluorescence-based biochemical high throughput dose response assay to identify inhibitors of phospholipase C isozymes (PLC-B3) PubChem Bioassay (2014)[AID] 
Target
Name:
1-phosphatidylinositol 4,5-bisphosphate phosphodiesterase beta-3
Synonyms:
PLCB3 Phospholipase C, beta 3 (phosphatidylinositol-specific) | Phospholipase C-beta-3
Type:
PROTEIN
Mol. Mass.:
138786.29
Organism:
Homo sapiens (Human)
Description:
EBI_12586
Residue:
1234
  
Inhibitor
Name:
BDBM114226
Synonyms:
2-(1,5-Dimethyl-3-oxo-2-phenyl-2,3-dihydro-1H-pyrazol-4-yl)-benzo[de]isoquinoline-1,3-dione 2-(1,5-dimethyl-3-oxo-2-phenyl-4-pyrazolyl)benzo[de]isoquinoline-1,3-dione 2-(3-keto-1,5-dimethyl-2-phenyl-3-pyrazolin-4-yl)benzo[de]isoquinoline-1,3-quinone SMR000120885 | cid_1071270
Type:
Small organic molecule
Emp. Form.:
C23H17N3O3
Mol. Mass.:
383.3994
SMILES:
Cc1c(N2C(=O)c3cccc4cccc(C2=O)c34)c(=O)n(-c2ccccc2)n1C
: