Target
1-phosphatidylinositol 4,5-bisphosphate phosphodiesterase beta-3
Ligand
BDBM114231
Substrate
Meas. Tech.
Fluorescence-based biochemical high throughput dose response assay to identify inhibitors of phospholipase C isozymes (PLC-B3)
IC50
122475±n/a nM
Citation
 PubChem, PC Fluorescence-based biochemical high throughput dose response assay to identify inhibitors of phospholipase C isozymes (PLC-B3) PubChem Bioassay (2014)[AID] 
Target
Name:
1-phosphatidylinositol 4,5-bisphosphate phosphodiesterase beta-3
Synonyms:
PLCB3 Phospholipase C, beta 3 (phosphatidylinositol-specific) | Phospholipase C-beta-3
Type:
PROTEIN
Mol. Mass.:
138786.29
Organism:
Homo sapiens (Human)
Description:
EBI_12586
Residue:
1234
  
Inhibitor
Name:
BDBM114231
Synonyms:
MLS000551486 N-[3-[4-(2-fluorophenyl)piperazin-1-yl]-1,4-bis(oxidanylidene)naphthalen-2-yl]-4-methyl-benzenesulfonamide N-[3-[4-(2-fluorophenyl)piperazino]-1,4-diketo-2-naphthyl]-4-methyl-benzenesulfonamide SMR000145411 | cid_3381552
Type:
Small organic molecule
Emp. Form.:
C27H24FN3O4S
Mol. Mass.:
505.561
SMILES:
Cc1ccc(cc1)S(=O)(=O)NC1=C(N2CCN(CC2)c2ccccc2F)C(=O)c2ccccc2C1=O
: