Target
1-phosphatidylinositol 4,5-bisphosphate phosphodiesterase beta-3
Ligand
BDBM114245
Substrate
Meas. Tech.
Fluorescence-based biochemical high throughput dose response assay to identify inhibitors of phospholipase C isozymes (PLC-B3)
IC50
122506±n/a nM
Citation
 PubChem, PC Fluorescence-based biochemical high throughput dose response assay to identify inhibitors of phospholipase C isozymes (PLC-B3) PubChem Bioassay (2014)[AID] 
Target
Name:
1-phosphatidylinositol 4,5-bisphosphate phosphodiesterase beta-3
Synonyms:
PLCB3 Phospholipase C, beta 3 (phosphatidylinositol-specific) | Phospholipase C-beta-3
Type:
PROTEIN
Mol. Mass.:
138786.29
Organism:
Homo sapiens (Human)
Description:
EBI_12586
Residue:
1234
  
Inhibitor
Name:
BDBM114245
Synonyms:
1-(1,5-dimethyl-3-oxidanylidene-2-phenyl-pyrazol-4-yl)-3-[(E)-[(E)-3-(4-nitrophenyl)prop-2-enylidene]amino]thiourea 1-(1,5-dimethyl-3-oxo-2-phenylpyrazol-4-yl)-3-[(E)-[(E)-3-(4-nitrophenyl)prop-2-enylidene]amino]thiourea 3-{4-nitrophenyl}acrylaldehyde N-(1,5-dimethyl-3-oxo-2-phenyl-2,3-dihydro-1H-pyrazol-4-yl)thiosemicarbazone SMR000225212 | cid_1641764
Type:
Small organic molecule
Emp. Form.:
C21H20N6O3S
Mol. Mass.:
436.487
SMILES:
Cc1c(NC(=S)NN=CC=Cc2ccc(cc2)[N+]([O-])=O)c(=O)n(-c2ccccc2)n1C
: