Target
1-phosphatidylinositol 4,5-bisphosphate phosphodiesterase beta-3
Ligand
BDBM114267
Substrate
Meas. Tech.
Fluorescence-based biochemical high throughput dose response assay to identify inhibitors of phospholipase C isozymes (PLC-B3)
IC50
122493±n/a nM
Citation
 PubChem, PC Fluorescence-based biochemical high throughput dose response assay to identify inhibitors of phospholipase C isozymes (PLC-B3) PubChem Bioassay (2014)[AID] 
Target
Name:
1-phosphatidylinositol 4,5-bisphosphate phosphodiesterase beta-3
Synonyms:
PLCB3 Phospholipase C, beta 3 (phosphatidylinositol-specific) | Phospholipase C-beta-3
Type:
PROTEIN
Mol. Mass.:
138786.29
Organism:
Homo sapiens (Human)
Description:
EBI_12586
Residue:
1234
  
Inhibitor
Name:
BDBM114267
Synonyms:
4-[(3-formyl-4-hydroxyphenyl)diazenyl]benzenesulfonate SMR000476016 sodium;4-[(2Z)-2-(3-formyl-4-oxo-1-cyclohexa-2,5-dienylidene)hydrazinyl]benzenesulfonate sodium;4-[(2Z)-2-(3-methanoyl-4-oxidanylidene-cyclohexa-2,5-dien-1-ylidene)hydrazinyl]benzenesulfonate | sodium;4-[(N'Z)-N'-(3-formyl-4-keto-cyclohexa-2,5-dien-1-ylidene)hydrazino]besylate
Type:
Small organic molecule
Emp. Form.:
C13H9N2O5S
Mol. Mass.:
305.287
SMILES:
Oc1ccc(cc1C=O)N=Nc1ccc(cc1)S([O-])(=O)=O
: