Target
1-phosphatidylinositol 4,5-bisphosphate phosphodiesterase beta-3
Ligand
BDBM60983
Substrate
Meas. Tech.
Fluorescence-based biochemical high throughput dose response assay to identify inhibitors of phospholipase C isozymes (PLC-B3)
IC50
122486±n/a nM
Citation
 PubChem, PC Fluorescence-based biochemical high throughput dose response assay to identify inhibitors of phospholipase C isozymes (PLC-B3) PubChem Bioassay (2014)[AID] 
Target
Name:
1-phosphatidylinositol 4,5-bisphosphate phosphodiesterase beta-3
Synonyms:
PLCB3 Phospholipase C, beta 3 (phosphatidylinositol-specific) | Phospholipase C-beta-3
Type:
PROTEIN
Mol. Mass.:
138786.29
Organism:
Homo sapiens (Human)
Description:
EBI_12586
Residue:
1234
  
Inhibitor
Name:
BDBM60983
Synonyms:
(E)-2-(3,4-dihydroxybenzoyl)-3-(4-hydroxy-3-iodo-5-methoxyphenyl)prop-2-enenitrile (E)-2-[3,4-bis(oxidanyl)phenyl]carbonyl-3-(3-iodanyl-5-methoxy-4-oxidanyl-phenyl)prop-2-enenitrile I-OMe-Tyrphostin AG 538 SMR001230793 | cid_5353685
Type:
Small organic molecule
Emp. Form.:
C17H12INO5
Mol. Mass.:
437.1854
SMILES:
COc1cc(\C=C(/C#N)C(=O)c2ccc(O)c(O)c2)cc(I)c1O
: