Target
1-phosphatidylinositol 4,5-bisphosphate phosphodiesterase beta-3
Ligand
BDBM114202
Substrate
Meas. Tech.
Fluorescence-based biochemical high throughput dose response assay to identify inhibitors of phospholipase C isozymes (PLC-B3)
IC50
122542±n/a nM
Citation
 PubChem, PC Fluorescence-based biochemical high throughput dose response assay to identify inhibitors of phospholipase C isozymes (PLC-B3) PubChem Bioassay (2014)[AID] 
Target
Name:
1-phosphatidylinositol 4,5-bisphosphate phosphodiesterase beta-3
Synonyms:
PLCB3 Phospholipase C, beta 3 (phosphatidylinositol-specific) | Phospholipase C-beta-3
Type:
PROTEIN
Mol. Mass.:
138786.29
Organism:
Homo sapiens (Human)
Description:
EBI_12586
Residue:
1234
  
Inhibitor
Name:
BDBM114202
Synonyms:
2-methyl-4,5-dioxo-3-(phenylmethyl)-1-benzo[e]indolecarboxylic acid ethyl ester MLS002702495 cid_406008 ethyl 3-benzyl-2-methyl-4,5-dioxobenzo[e]indole-1-carboxylate
Type:
Small organic molecule
Emp. Form.:
C23H19NO4
Mol. Mass.:
373.4013
SMILES:
CCOC(=O)c1c(C)n(Cc2ccccc2)c2c1-c1ccccc1C(=O)C2=O
: