Target
1-phosphatidylinositol 4,5-bisphosphate phosphodiesterase beta-3
Ligand
BDBM113990
Substrate
Meas. Tech.
Fluorescence-based biochemical high throughput dose response assay to identify inhibitors of phospholipase C isozymes (PLC-B3)
IC50
122493±n/a nM
Citation
 PubChem, PC Fluorescence-based biochemical high throughput dose response assay to identify inhibitors of phospholipase C isozymes (PLC-B3) PubChem Bioassay (2014)[AID] 
Target
Name:
1-phosphatidylinositol 4,5-bisphosphate phosphodiesterase beta-3
Synonyms:
PLCB3 Phospholipase C, beta 3 (phosphatidylinositol-specific) | Phospholipase C-beta-3
Type:
PROTEIN
Mol. Mass.:
138786.29
Organism:
Homo sapiens (Human)
Description:
EBI_12586
Residue:
1234
  
Inhibitor
Name:
BDBM113990
Synonyms:
2-[(2R,4aS,12aS)-8-[(2-fluorophenyl)carbamoylamino]-5-methyl-6-oxidanylidene-2,3,4,4a,12,12a-hexahydropyrano[2,3-c][1,5]benzoxazocin-2-yl]-N-[(4-phenylphenyl)methyl]ethanamide 2-[(2R,4aS,12aS)-8-[(2-fluorophenyl)carbamoylamino]-6-keto-5-methyl-2,3,4,4a,12,12a-hexahydropyrano[2,3-c][1,5]benzoxazocin-2-yl]-N-(4-phenylbenzyl)acetamide MLS004342537 cid_54654643
Type:
Small organic molecule
Emp. Form.:
C36H35FN4O5
Mol. Mass.:
622.6853
SMILES:
CN1[C@H]2CC[C@H](CC(=O)NCc3ccc(cc3)-c3ccccc3)O[C@@H]2COc2ccc(NC(=O)Nc3ccccc3F)cc2C1=O
: