Target
1-phosphatidylinositol 4,5-bisphosphate phosphodiesterase gamma-1 [1-999,I813T]
Ligand
BDBM114234
Substrate
Meas. Tech.
Counterscreen for inhibitors of phospholipase C isozymes (PLC-B3): Fluorescence-based biochemical high throughput dose response assay to identify inhibitors of phospholipase C isozymes (PLC-gamma1)
IC50
122440±n/a nM
Citation
 PubChem, PC Counterscreen for inhibitors of phospholipase C isozymes (PLC-B3): Fluorescence-based biochemical high throughput dose response assay to identify inhibitors of phospholipase C isozymes (PLC-gamma1) PubChem Bioassay (2014)[AID] 
Target
Name:
1-phosphatidylinositol 4,5-bisphosphate phosphodiesterase gamma-1 [1-999,I813T]
Synonyms:
PLC1 PLCG1_HUMAN | Phospholipase C, gamma 1
Type:
Enzyme Catalytic Domain
Mol. Mass.:
115282.60
Organism:
Homo sapiens (Human)
Description:
gi_223459640
Residue:
999
  
Inhibitor
Name:
BDBM114234
Synonyms:
4-tert-butyl-N-phenyl-1-cyclohexanecarboxamide 4-tert-butyl-N-phenyl-cyclohexanecarboxamide MLS000536601 cid_2118495
Type:
Small organic molecule
Emp. Form.:
C17H25NO
Mol. Mass.:
259.3865
SMILES:
CC(C)(C)C1CCC(CC1)C(=O)Nc1ccccc1
: