Target
1-phosphatidylinositol 4,5-bisphosphate phosphodiesterase gamma-1 [1-999,I813T]
Ligand
BDBM50386
Substrate
Meas. Tech.
Counterscreen for inhibitors of phospholipase C isozymes (PLC-B3): Fluorescence-based biochemical high throughput dose response assay to identify inhibitors of phospholipase C isozymes (PLC-gamma1)
IC50
122517±n/a nM
Citation
 PubChem, PC Counterscreen for inhibitors of phospholipase C isozymes (PLC-B3): Fluorescence-based biochemical high throughput dose response assay to identify inhibitors of phospholipase C isozymes (PLC-gamma1) PubChem Bioassay (2014)[AID] 
Target
Name:
1-phosphatidylinositol 4,5-bisphosphate phosphodiesterase gamma-1 [1-999,I813T]
Synonyms:
PLC1 PLCG1_HUMAN | Phospholipase C, gamma 1
Type:
Enzyme Catalytic Domain
Mol. Mass.:
115282.60
Organism:
Homo sapiens (Human)
Description:
gi_223459640
Residue:
999
  
Inhibitor
Name:
BDBM50386
Synonyms:
MLS000334119 N-[4-(4-acetamidophenyl)-1,3-thiazol-2-yl]-1-(2,3-dihydro-1,4-benzodioxin-6-yl)-5-oxopyrrolidine-3-carboxamide N-[4-(4-acetamidophenyl)thiazol-2-yl]-1-(2,3-dihydro-1,4-benzodioxin-6-yl)-5-keto-pyrrolidine-3-carboxamide cid_4326903
Type:
Small organic molecule
Emp. Form.:
C24H22N4O5S
Mol. Mass.:
478.52
SMILES:
CC(=O)Nc1ccc(cc1)-c1csc(NC(=O)C2CN(C(=O)C2)c2ccc3OCCOc3c2)n1
: