Target
1-phosphatidylinositol 4,5-bisphosphate phosphodiesterase gamma-1 [1-999,I813T]
Ligand
BDBM53139
Substrate
Meas. Tech.
Counterscreen for inhibitors of phospholipase C isozymes (PLC-B3): Fluorescence-based biochemical high throughput dose response assay to identify inhibitors of phospholipase C isozymes (PLC-gamma1)
IC50
122476±n/a nM
Citation
 PubChem, PC Counterscreen for inhibitors of phospholipase C isozymes (PLC-B3): Fluorescence-based biochemical high throughput dose response assay to identify inhibitors of phospholipase C isozymes (PLC-gamma1) PubChem Bioassay (2014)[AID] 
Target
Name:
1-phosphatidylinositol 4,5-bisphosphate phosphodiesterase gamma-1 [1-999,I813T]
Synonyms:
PLC1 PLCG1_HUMAN | Phospholipase C, gamma 1
Type:
Enzyme Catalytic Domain
Mol. Mass.:
115282.60
Organism:
Homo sapiens (Human)
Description:
gi_223459640
Residue:
999
  
Inhibitor
Name:
BDBM53139
Synonyms:
4-[[(E)-3-(2-furyl)acryloyl]thiocarbamoylamino]benzoic acid 4-[[[[(E)-3-(2-furanyl)-1-oxoprop-2-enyl]amino]-sulfanylidenemethyl]amino]benzoic acid SMR000539235 | cid_947839
Type:
Small organic molecule
Emp. Form.:
C15H12N2O4S
Mol. Mass.:
316.332
SMILES:
OC(=O)c1ccc(NC(=S)NC(=O)C=Cc2ccco2)cc1
: