Target
Major prion protein
Ligand
BDBM66153
Substrate
Meas. Tech.
TRFRET-based cell-based high throughput dose response assay to identify inhibitors of cell surface Prion Protein (PRPC)
IC50
1382±n/a nM
Citation
 PubChem, PC TRFRET-based cell-based high throughput dose response assay to identify inhibitors of cell surface Prion Protein (PRPC) PubChem Bioassay (2014)[AID] 
Target
Name:
Major prion protein
Synonyms:
ALTPRP CD_antigen=CD230 PRIP PRP PrP33-35C major prion protein preproprotein
Type:
PROTEIN
Mol. Mass.:
27671.97
Organism:
Homo sapiens (Human)
Description:
ChEMBL_158887
Residue:
253
  
Inhibitor
Name:
BDBM66153
Synonyms:
6,8-bis(bromanyl)-4-piperidin-1-yl-quinazoline 6,8-dibromo-4-piperidin-1-ylquinazoline MLS000038796 cid_659524
Type:
Small organic molecule
Emp. Form.:
C13H13Br2N3
Mol. Mass.:
371.07
SMILES:
Brc1cc(Br)c2ncnc(N3CCCCC3)c2c1
: