Target
Major prion protein
Ligand
BDBM114360
Substrate
Meas. Tech.
TRFRET-based cell-based high throughput dose response assay to identify inhibitors of cell surface Prion Protein (PRPC)
IC50
759.13±n/a nM
Citation
 PubChem, PC TRFRET-based cell-based high throughput dose response assay to identify inhibitors of cell surface Prion Protein (PRPC) PubChem Bioassay (2014)[AID] 
Target
Name:
Major prion protein
Synonyms:
ALTPRP CD_antigen=CD230 PRIP PRP PrP33-35C major prion protein preproprotein
Type:
PROTEIN
Mol. Mass.:
27671.97
Organism:
Homo sapiens (Human)
Description:
ChEMBL_158887
Residue:
253
  
Inhibitor
Name:
BDBM114360
Synonyms:
2-methoxy-5-[[4-(4-oxidanylidenecyclohexa-2,5-dien-1-ylidene)-3H-phthalazin-1-yl]amino]benzamide 2-methoxy-5-[[4-(4-oxocyclohexa-2,5-dien-1-ylidene)-3H-phthalazin-1-yl]amino]benzamide MLS000714775 cid_5438298
Type:
Small organic molecule
Emp. Form.:
C22H18N4O3
Mol. Mass.:
386.4033
SMILES:
COc1ccc(Nc2nnc(-c3ccc(O)cc3)c3ccccc23)cc1C(N)=O
: