Target
Major prion protein
Ligand
BDBM47311
Substrate
Meas. Tech.
TRFRET-based cell-based high throughput dose response assay to identify inhibitors of cell surface Prion Protein (PRPC)
IC50
1048±n/a nM
Citation
 PubChem, PC TRFRET-based cell-based high throughput dose response assay to identify inhibitors of cell surface Prion Protein (PRPC) PubChem Bioassay (2014)[AID] 
Target
Name:
Major prion protein
Synonyms:
ALTPRP CD_antigen=CD230 PRIP PRP PrP33-35C major prion protein preproprotein
Type:
PROTEIN
Mol. Mass.:
27671.97
Organism:
Homo sapiens (Human)
Description:
ChEMBL_158887
Residue:
253
  
Inhibitor
Name:
BDBM47311
Synonyms:
2-[(4-chlorobenzyl)sulfanyl]-6-oxo-4-(2-thienyl)-1,6-dihydro-5-pyrimidinecarbonitrile 2-[(4-chlorophenyl)methylsulfanyl]-4-oxidanylidene-6-thiophen-2-yl-1H-pyrimidine-5-carbonitrile 2-[(4-chlorophenyl)methylthio]-4-oxo-6-thiophen-2-yl-1H-pyrimidine-5-carbonitrile SMR000231786 | cid_1234393
Type:
Small organic molecule
Emp. Form.:
C16H10ClN3OS2
Mol. Mass.:
359.853
SMILES:
Clc1ccc(CSc2nc(-c3cccs3)c(C#N)c(=O)[nH]2)cc1
: