Target
Major prion protein
Ligand
BDBM66190
Substrate
Meas. Tech.
TRFRET-based cell-based high throughput dose response assay to identify inhibitors of cell surface Prion Protein (PRPC)
IC50
1919±n/a nM
Citation
 PubChem, PC TRFRET-based cell-based high throughput dose response assay to identify inhibitors of cell surface Prion Protein (PRPC) PubChem Bioassay (2014)[AID] 
Target
Name:
Major prion protein
Synonyms:
ALTPRP CD_antigen=CD230 PRIP PRP PrP33-35C major prion protein preproprotein
Type:
PROTEIN
Mol. Mass.:
27671.97
Organism:
Homo sapiens (Human)
Description:
ChEMBL_158887
Residue:
253
  
Inhibitor
Name:
BDBM66190
Synonyms:
2-amino-6-(dicyanomethylene)-4-phenyl-1H-pyridine-3,5-dicarbonitrile 2-azanyl-6-(dicyanomethylidene)-4-phenyl-1H-pyridine-3,5-dicarbonitrile SMR000539348 | cid_910973
Type:
Small organic molecule
Emp. Form.:
C16H8N6
Mol. Mass.:
284.2749
SMILES:
Nc1nc(C(C#N)C#N)c(C#N)c(-c2ccccc2)c1C#N
: