Target
Group 3 secretory phospholipase A2
Ligand
BDBM47275
Substrate
Meas. Tech.
QFRET-based biochemical high throughput dose response assay to identify inhibitors of human group III secreted phospholipase A2 enzyme (HGIII-sPLA2)
IC50
33990±n/a nM
Citation
 PubChem, PC QFRET-based biochemical high throughput dose response assay to identify inhibitors of human group III secreted phospholipase A2 enzyme (HGIII-sPLA2) PubChem Bioassay (2014)[AID] 
Target
Name:
Group 3 secretory phospholipase A2
Synonyms:
3.1.1.4 Group III secretory phopholipase A2 PA2G3_HUMAN Phosphatidylcholine 2-acylhydrolase 3 sPLA2-III
Type:
PROTEIN
Mol. Mass.:
57196.58
Organism:
Homo sapiens
Description:
ChEMBL_119722
Residue:
509
  
Inhibitor
Name:
BDBM47275
Synonyms:
4-[(E)-2-(1-ethyl-2-quinolin-1-iumyl)ethenyl]-N,N-dimethylaniline;iodide 4-[(E)-2-(1-ethylquinolin-1-ium-2-yl)ethenyl]-N,N-dimethylaniline;iodide SMR000264929 cid_5702759
Type:
Small organic molecule
Emp. Form.:
C21H23N2
Mol. Mass.:
303.4202
SMILES:
CC[n+]1c(\C=C\c2ccc(cc2)N(C)C)ccc2ccccc12
: