Target
5-hydroxytryptamine receptor 2A
Ligand
BDBM114610
Substrate
Meas. Tech.
Late stage for the probe development effort to identify agonists of the mouse 5-hydroxytryptamine (serotonin) receptor 2A (HTR2A)
EC50
76083±n/a nM
Citation
 PubChem, PC Late stage for the probe development effort to identify agonists of the mouse 5-hydroxytryptamine (serotonin) receptor 2A (HTR2A): Luminescence-based cell-based high throughput dose response assay for agonists of the mouse 5-hydroxytryptamine (serotonin) receptor 2A (HTR2A) PubChem Bioassay (2013)[AID] 
Target
Name:
5-hydroxytryptamine receptor 2A
Synonyms:
5-HT-2 5-hydroxytryptamine receptor 2A 5HT2A_MOUSE Htr2 Serotonin 2a (5-HT2a) receptor
Type:
Enzyme
Mol. Mass.:
52843.00
Organism:
Mus musculus (Mouse)
Description:
P35363
Residue:
471
  
Inhibitor
Name:
BDBM114610
Synonyms:
1-(2-chlorobenzyl)-4-phenyl-piperazine 1-[(2-chlorophenyl)methyl]-4-phenylpiperazine SR-01000667636-2 | cid_765042
Type:
Small organic molecule
Emp. Form.:
C17H19ClN2
Mol. Mass.:
286.799
SMILES:
Clc1ccccc1CN1CCN(CC1)c1ccccc1
: