Target
5-hydroxytryptamine receptor 2A
Ligand
BDBM114621
Substrate
Meas. Tech.
Late stage for the probe development effort to identify agonists of the mouse 5-hydroxytryptamine (serotonin) receptor 2A (HTR2A)
EC50
76083±n/a nM
Citation
 PubChem, PC Late stage for the probe development effort to identify agonists of the mouse 5-hydroxytryptamine (serotonin) receptor 2A (HTR2A): Luminescence-based cell-based high throughput dose response assay for agonists of the mouse 5-hydroxytryptamine (serotonin) receptor 2A (HTR2A) PubChem Bioassay (2013)[AID] 
Target
Name:
5-hydroxytryptamine receptor 2A
Synonyms:
5-HT-2 5-hydroxytryptamine receptor 2A 5HT2A_MOUSE Htr2 Serotonin 2a (5-HT2a) receptor
Type:
Enzyme
Mol. Mass.:
52843.00
Organism:
Mus musculus (Mouse)
Description:
P35363
Residue:
471
  
Inhibitor
Name:
BDBM114621
Synonyms:
4-[4-(2-hydroxy-3-piperidino-propoxy)benzyl]piperazine-1-carboxylic acid ethyl ester SR-01000181557 cid_23723421 ethyl 4-[[4-(2-oxidanyl-3-piperidin-1-yl-propoxy)phenyl]methyl]piperazine-1-carboxylate
Type:
Small organic molecule
Emp. Form.:
C22H35N3O4
Mol. Mass.:
405.531
SMILES:
CCOC(=O)N1CCN(Cc2ccc(OCC(O)CN3CCCCC3)cc2)CC1
: