Target
5-hydroxytryptamine receptor 2A
Ligand
BDBM114623
Substrate
Meas. Tech.
Late stage for the probe development effort to identify agonists of the mouse 5-hydroxytryptamine (serotonin) receptor 2A (HTR2A)
EC50
76083±n/a nM
Citation
 PubChem, PC Late stage for the probe development effort to identify agonists of the mouse 5-hydroxytryptamine (serotonin) receptor 2A (HTR2A): Luminescence-based cell-based high throughput dose response assay for agonists of the mouse 5-hydroxytryptamine (serotonin) receptor 2A (HTR2A) PubChem Bioassay (2013)[AID] 
Target
Name:
5-hydroxytryptamine receptor 2A
Synonyms:
5-HT-2 5-hydroxytryptamine receptor 2A 5HT2A_MOUSE Htr2 Serotonin 2a (5-HT2a) receptor
Type:
Enzyme
Mol. Mass.:
52843.00
Organism:
Mus musculus (Mouse)
Description:
P35363
Residue:
471
  
Inhibitor
Name:
BDBM114623
Synonyms:
1-(2-pyridinyl)-4-(3-thiophenylmethyl)piperazine 1-pyridin-2-yl-4-(thiophen-3-ylmethyl)piperazine SR-01000201826-3 | cid_763728
Type:
Small organic molecule
Emp. Form.:
C14H17N3S
Mol. Mass.:
259.37
SMILES:
C(N1CCN(CC1)c1ccccn1)c1ccsc1
: