Target
Methyl-CpG-binding domain protein 2
Ligand
BDBM40004
Substrate
Meas. Tech.
TRFRET-based biochemical high throughput dose response assay to identify inhibitors of 5-meCpG-binding domain protein 2 (MBD2)-DBD binding to methylated oligonucleotide
IC50
43812±n/a nM
Citation
 PubChem, PC TRFRET-based biochemical high throughput dose response assay to identify inhibitors of 5-meCpG-binding domain protein 2 (MBD2)-DBD binding to methylated oligonucleotide PubChem Bioassay (2013)[AID] 
Target
Name:
Methyl-CpG-binding domain protein 2
Synonyms:
MBD2 Methyl-CpG binding domain protein 2 | Methyl-CpG-binding domain protein 2 (MBD2)
Type:
Enzyme Catalytic Domain
Mol. Mass.:
43278.74
Organism:
Homo sapiens (Human)
Description:
gi_21595776
Residue:
411
  
Inhibitor
Name:
BDBM40004
Synonyms:
(4-oxidanylidenepyrimido[2,1-b][1,3]benzothiazol-2-yl)methyl 2-(6,7-dihydro-5H-cyclopenta[f][1]benzofuran-3-yl)ethanoate 2-(6,7-dihydro-5H-cyclopenta[f]benzofuran-3-yl)acetic acid (4-ketopyrimido[2,1-b][1,3]benzothiazol-2-yl)methyl ester MLS000056010 cid_3000165
Type:
Small organic molecule
Emp. Form.:
C24H18N2O4S
Mol. Mass.:
430.476
SMILES:
O=C(Cc1coc2cc3CCCc3cc12)OCc1cc(=O)n2c(n1)sc1ccccc21
: