Target
Methyl-CpG-binding domain protein 2
Ligand
BDBM114647
Substrate
Meas. Tech.
TRFRET-based biochemical high throughput dose response assay to identify inhibitors of 5-meCpG-binding domain protein 2 (MBD2)-DBD binding to methylated oligonucleotide
IC50
43791±n/a nM
Citation
 PubChem, PC TRFRET-based biochemical high throughput dose response assay to identify inhibitors of 5-meCpG-binding domain protein 2 (MBD2)-DBD binding to methylated oligonucleotide PubChem Bioassay (2013)[AID] 
Target
Name:
Methyl-CpG-binding domain protein 2
Synonyms:
MBD2 Methyl-CpG binding domain protein 2 | Methyl-CpG-binding domain protein 2 (MBD2)
Type:
Enzyme Catalytic Domain
Mol. Mass.:
43278.74
Organism:
Homo sapiens (Human)
Description:
gi_21595776
Residue:
411
  
Inhibitor
Name:
BDBM114647
Synonyms:
3-[6-[2-(dimethylamino)phenyl]-8-formamido-3-imidazo[1,2-a]pyridinyl]-N,N-dimethylbenzamide 3-[6-[2-(dimethylamino)phenyl]-8-formamidoimidazo[1,2-a]pyridin-3-yl]-N,N-dimethylbenzamide SMR001292898 | cid_49789798
Type:
Small organic molecule
Emp. Form.:
C25H25N5O2
Mol. Mass.:
427.4983
SMILES:
CN(C)C(=O)c1cccc(c1)-c1cnc2c(NC=O)cc(cn12)-c1ccccc1N(C)C
: