Target
Fibrinogen beta chain [164-491]
Ligand
BDBM114655
Substrate
Meas. Tech.
Fluorescence polarization-based biochemical high throughput dose response assay to identify inhibitors that disrupt the binding of a cyclic peptide (Tn6) to the fibrin proteolytic product D-Dimer
IC50
21023±n/a nM
Citation
 PubChem, PC Fluorescence polarization-based biochemical high throughput dose response assay to identify inhibitors that disrupt the binding of a cyclic peptide (Tn6) to the fibrin proteolytic product D-Dimer and fragment E complex [DD(E )] PubChem Bioassay (2013)[AID] 
Target
Name:
Fibrinogen beta chain [164-491]
Synonyms:
Chain E, Fragment Double-D From Human Fibrin FIBB_HUMAN
Type:
Enzyme Catalytic Domain
Mol. Mass.:
37647.12
Organism:
Homo sapiens (Human)
Description:
gi_28373962
Residue:
328
  
Inhibitor
Name:
BDBM114655
Synonyms:
MLS000529672 N-[(1,2-dimethylindol-5-yl)methyl]naphthalene-2-sulfonamide cid_5046151
Type:
Small organic molecule
Emp. Form.:
C21H20N2O2S
Mol. Mass.:
364.461
SMILES:
Cc1cc2cc(CNS(=O)(=O)c3ccc4ccccc4c3)ccc2n1C
: