Target
Fibrinogen beta chain [164-491]
Ligand
BDBM25525
Substrate
Meas. Tech.
Fluorescence polarization-based biochemical high throughput dose response assay to identify inhibitors that disrupt the binding of a cyclic peptide (Tn6) to the fibrin proteolytic product D-Dimer
IC50
24165±n/a nM
Citation
 PubChem, PC Fluorescence polarization-based biochemical high throughput dose response assay to identify inhibitors that disrupt the binding of a cyclic peptide (Tn6) to the fibrin proteolytic product D-Dimer and fragment E complex [DD(E )] PubChem Bioassay (2013)[AID] 
Target
Name:
Fibrinogen beta chain [164-491]
Synonyms:
Chain E, Fragment Double-D From Human Fibrin FIBB_HUMAN
Type:
Enzyme Catalytic Domain
Mol. Mass.:
37647.12
Organism:
Homo sapiens (Human)
Description:
gi_28373962
Residue:
328
  
Inhibitor
Name:
BDBM25525
Synonyms:
24-methyl-5,7,18,20-tetraoxa-24-azahexacyclo[11.11.0.0^{2,10}.0^{4,8}.0^{14,22}.0^{17,21}]tetracosa-1(13),2,4(8),9,11,14(22),15,17(21),23-nonaen-24-ium Pseudochelerythrine cid_5154 sangvinarin
Type:
Small organic molecule
Emp. Form.:
C20H14NO4
Mol. Mass.:
332.3289
SMILES:
C[n+]1cc2c3OCOc3ccc2c2ccc3cc4OCOc4cc3c12
: