Target
Fibrinogen beta chain [164-491]
Ligand
BDBM114665
Substrate
Meas. Tech.
Fluorescence polarization-based biochemical high throughput dose response assay to identify inhibitors that disrupt the binding of a cyclic peptide (Tn7) to the fibrin proteolytic product D-Dimer
IC50
83271±n/a nM
Citation
 PubChem, PC Fluorescence polarization-based biochemical high throughput dose response assay to identify inhibitors that disrupt the binding of a cyclic peptide (Tn7) to the fibrin proteolytic product D-Dimer and fragment E complex [DD(E )] PubChem Bioassay (2013)[AID] 
Target
Name:
Fibrinogen beta chain [164-491]
Synonyms:
Chain E, Fragment Double-D From Human Fibrin FIBB_HUMAN
Type:
Enzyme Catalytic Domain
Mol. Mass.:
37647.12
Organism:
Homo sapiens (Human)
Description:
gi_28373962
Residue:
328
  
Inhibitor
Name:
BDBM114665
Synonyms:
1,5-bis[3-(2-hydroxyethylamino)propylamino]-9,10-anthraquinone MLS002701865 cid_335352
Type:
Small organic molecule
Emp. Form.:
C24H32N4O4
Mol. Mass.:
440.5353
SMILES:
OCCNCCCNc1cccc2C(=O)c3c(NCCCNCCO)cccc3C(=O)c12
: