Target
Protein artemis
Ligand
BDBM94959
Substrate
Meas. Tech.
Dose Response confirmation of small molecule inhibitors originally identified via uHTS of Artemis endonuclease activity via a fluorescence intensity assay
IC50
20000±n/a nM
Citation
 PubChem, PC Dose Response confirmation of small molecule inhibitors originally identified via uHTS of Artemis endonuclease activity via a fluorescence intensity assay PubChem Bioassay (2013)[AID] 
Target
Name:
Protein artemis
Synonyms:
ARTEMIS DCLRE1C SCIDA protein artemis isoform a
Type:
Enzyme Catalytic Domain
Mol. Mass.:
78427.91
Organism:
Homo sapiens (Human)
Description:
gi_76496497
Residue:
692
  
Inhibitor
Name:
BDBM94959
Synonyms:
2-(6-imidazo[2,1-b]thiazolyl)-N-[5-(phenylmethyl)-6,7-dihydro-4H-thiazolo[5,4-c]pyridin-2-yl]acetamide MLS000055247 N-(5-benzyl-6,7-dihydro-4H-thiazolo[5,4-c]pyridin-2-yl)-2-imidazo[2,1-b]thiazol-6-yl-acetamide cid_3000110
Type:
Small organic molecule
Emp. Form.:
C20H19N5OS2
Mol. Mass.:
409.528
SMILES:
O=C(Cc1cn2ccsc2n1)Nc1nc2CCN(Cc3ccccc3)Cc2s1
: