Target
Protein artemis
Ligand
BDBM52143
Substrate
Meas. Tech.
Dose Response confirmation of small molecule inhibitors originally identified via uHTS of Artemis endonuclease activity via a fluorescence intensity assay
IC50
5000±n/a nM
Citation
 PubChem, PC Dose Response confirmation of small molecule inhibitors originally identified via uHTS of Artemis endonuclease activity via a fluorescence intensity assay PubChem Bioassay (2013)[AID] 
Target
Name:
Protein artemis
Synonyms:
ARTEMIS DCLRE1C SCIDA protein artemis isoform a
Type:
Enzyme Catalytic Domain
Mol. Mass.:
78427.91
Organism:
Homo sapiens (Human)
Description:
gi_76496497
Residue:
692
  
Inhibitor
Name:
BDBM52143
Synonyms:
2-cyano-N-(phenylmethyl)-2-(3-pyrrolidin-1-ylquinoxalin-2-yl)ethanamide MLS000057770 N-benzyl-2-cyano-2-(3-pyrrolidinoquinoxalin-2-yl)acetamide cid_2998487
Type:
Small organic molecule
Emp. Form.:
C22H21N5O
Mol. Mass.:
371.435
SMILES:
O=C(NCc1ccccc1)C(C#N)c1nc2ccccc2nc1N1CCCC1
: