Target
Protein artemis
Ligand
BDBM114695
Substrate
Meas. Tech.
Dose Response confirmation of small molecule inhibitors originally identified via uHTS of Artemis endonuclease activity via a fluorescence intensity assay
IC50
20000±n/a nM
Citation
 PubChem, PC Dose Response confirmation of small molecule inhibitors originally identified via uHTS of Artemis endonuclease activity via a fluorescence intensity assay PubChem Bioassay (2013)[AID] 
Target
Name:
Protein artemis
Synonyms:
ARTEMIS DCLRE1C SCIDA protein artemis isoform a
Type:
Enzyme Catalytic Domain
Mol. Mass.:
78427.91
Organism:
Homo sapiens (Human)
Description:
gi_76496497
Residue:
692
  
Inhibitor
Name:
BDBM114695
Synonyms:
MLS000566628 N-(5-ethyl-6,7-dihydro-4H-[1,3]thiazolo[5,4-c]pyridin-2-yl)-2,2-diphenylacetamide N-(5-ethyl-6,7-dihydro-4H-thiazolo[5,4-c]pyridin-2-yl)-2,2-diphenylacetamide cid_2464292
Type:
Small organic molecule
Emp. Form.:
C22H23N3OS
Mol. Mass.:
377.503
SMILES:
CCN1CCc2nc(NC(=O)C(c3ccccc3)c3ccccc3)sc2C1
: