Target
Protein artemis
Ligand
BDBM40705
Substrate
Meas. Tech.
Dose Response confirmation of small molecule inhibitors originally identified via uHTS of Artemis endonuclease activity via a fluorescence intensity assay
IC50
20000±n/a nM
Citation
 PubChem, PC Dose Response confirmation of small molecule inhibitors originally identified via uHTS of Artemis endonuclease activity via a fluorescence intensity assay PubChem Bioassay (2013)[AID] 
Target
Name:
Protein artemis
Synonyms:
ARTEMIS DCLRE1C SCIDA protein artemis isoform a
Type:
Enzyme Catalytic Domain
Mol. Mass.:
78427.91
Organism:
Homo sapiens (Human)
Description:
gi_76496497
Residue:
692
  
Inhibitor
Name:
BDBM40705
Synonyms:
4-(1,2,5-trimethyl-3-pyrrolyl)-2-thiazolamine MLS000566785 [4-(1,2,5-trimethylpyrrol-3-yl)thiazol-2-yl]amine | cid_2566124
Type:
Small organic molecule
Emp. Form.:
C10H13N3S
Mol. Mass.:
207.295
SMILES:
Cc1cc(-c2csc(N)n2)c(C)n1C
: