Target
Protein artemis
Ligand
BDBM44015
Substrate
Meas. Tech.
Dose Response confirmation of small molecule inhibitors originally identified via uHTS of Artemis endonuclease activity via a fluorescence intensity assay
IC50
20000±n/a nM
Citation
 PubChem, PC Dose Response confirmation of small molecule inhibitors originally identified via uHTS of Artemis endonuclease activity via a fluorescence intensity assay PubChem Bioassay (2013)[AID] 
Target
Name:
Protein artemis
Synonyms:
ARTEMIS DCLRE1C SCIDA protein artemis isoform a
Type:
Enzyme Catalytic Domain
Mol. Mass.:
78427.91
Organism:
Homo sapiens (Human)
Description:
gi_76496497
Residue:
692
  
Inhibitor
Name:
BDBM44015
Synonyms:
3-(4-chlorophenyl)-4-[(E)-[(E)-3-(2-nitrophenyl)prop-2-enylidene]amino]-1H-1,2,4-triazole-5-thione 5-(4-Chloro-phenyl)-4-[(E)-3-(2-nitro-phenyl)-prop-2-en-(E)-ylideneamino]-4H-[1,2,4]triazole-3-thiol SMR000147223 | cid_1955345
Type:
Small organic molecule
Emp. Form.:
C17H12ClN5O2S
Mol. Mass.:
385.827
SMILES:
[O-][N+](=O)c1ccccc1C=C[CH+][N-]n1c(n[nH]c1=S)-c1ccc(Cl)cc1
: