Target
Protein artemis
Ligand
BDBM44997
Substrate
Meas. Tech.
Dose Response confirmation of small molecule inhibitors originally identified via uHTS of Artemis endonuclease activity via a fluorescence intensity assay
IC50
16900±n/a nM
Citation
 PubChem, PC Dose Response confirmation of small molecule inhibitors originally identified via uHTS of Artemis endonuclease activity via a fluorescence intensity assay PubChem Bioassay (2013)[AID] 
Target
Name:
Protein artemis
Synonyms:
ARTEMIS DCLRE1C SCIDA protein artemis isoform a
Type:
Enzyme Catalytic Domain
Mol. Mass.:
78427.91
Organism:
Homo sapiens (Human)
Description:
gi_76496497
Residue:
692
  
Inhibitor
Name:
BDBM44997
Synonyms:
(3E)-2-amino-3-[(4-methylphenyl)hydrazinylidene]-5-phenyl-7-pyrazolo[1,5-a]pyrimidinone (3E)-2-amino-5-phenyl-3-(p-tolylhydrazono)pyrazolo[1,5-a]pyrimidin-7-one 2-amino-3-[(4-methylphenyl)diazenyl]-5-phenylpyrazolo[1,5-a]pyrimidin-7(4H)-one SMR000162510 | cid_11958770
Type:
Small organic molecule
Emp. Form.:
C19H16N6O
Mol. Mass.:
344.3699
SMILES:
Cc1ccc(cc1)N=Nc1c(N)[nH]n2c1nc(cc2=O)-c1ccccc1
: